freebsd 9.0 и KDE3

Простые/общие вопросы по UNIX системам. Спросите здесь, если вы новичок

Модераторы: vadim64, terminus

Правила форума
Убедительная просьба юзать теги [cоde] при оформлении листингов.
Сообщения не оформленные должным образом имеют все шансы быть незамеченными.
ski
старшина
Сообщения: 412
Зарегистрирован: 2008-08-25 18:10:44
Откуда: СССР, РФ, Сталинградская область, село Безродное
Контактная информация:

freebsd 9.0 и KDE3

Непрочитанное сообщение ski » 2012-05-14 9:07:48

А нынче как-нить можно собрать kde3 freebsd 9?

Код: Выделить всё

uname -a
FreeBSD test.daemony.ru 9.0-STABLE FreeBSD 9.0-STABLE #0: Wed Jan 11 09:55:51 VOLT 2012     root@test.daemony.ru:/usr/obj/usr/src/sys/test  i386
А то заностальгировалось мне, но сборка kdebase3 вываливается на crypto, интернеты рассказывают про патч для openbsd порта (патчится crypto.cpp), однако, судя по выводу, обламывается все на /usr/local/include/kopenssl.h (ну и патч опенбсдшный у меня мозгов не хватает адаптировать к своим нуждам):

Код: Выделить всё

In file included from crypto.cpp:88:
/usr/local/include/kopenssl.h:453: error: ISO C++ forbids declaration of 'ASN1_METHOD' with no type
/usr/local/include/kopenssl.h:453: error: expected ';' before '*' token
/usr/local/include/kopenssl.h:526: error: expected ';' before '(' token
/usr/local/include/kopenssl.h:532: error: 'STACK' has not been declared
/usr/local/include/kopenssl.h:538: error: 'STACK' has not been declared
/usr/local/include/kopenssl.h:544: error: expected ';' before '(' token
/usr/local/include/kopenssl.h:550: error: ISO C++ forbids declaration of 'STACK' with no type
/usr/local/include/kopenssl.h:550: error: expected ';' before '*' token
/usr/local/include/kopenssl.h:556: error: 'STACK' has not been declared
/usr/local/include/kopenssl.h:562: error: ISO C++ forbids declaration of 'STACK' with no type
/usr/local/include/kopenssl.h:562: error: expected ';' before '*' token
/usr/local/include/kopenssl.h:828: error: ISO C++ forbids declaration of 'STACK' with no type
/usr/local/include/kopenssl.h:828: error: expected ';' before '*' token
/usr/local/include/kopenssl.h:829: error: 'STACK' has not been declared
crypto.cpp: In member function 'void KCryptoConfig::slotCAImport()':
crypto.cpp:1851: error: no matching function for call to 'KOpenSSLProxy::sk_num(_STACK*)'
/usr/local/include/kopenssl.h:538: note: candidates are: int KOpenSSLProxy::sk_num(int*)
crypto.cpp:1852: error: 'class KOpenSSLProxy' has no member named 'sk_value'
crypto.cpp: In member function 'bool KCryptoConfig::loadCiphers()':
crypto.cpp:2329: error: invalid conversion from 'const SSL_METHOD*' to 'SSL_METHOD*'
crypto.cpp:2341: error: invalid conversion from 'const SSL_CIPHER*' to 'SSL_CIPHER*'
crypto.cpp:2358: error: invalid conversion from 'const SSL_METHOD*' to 'SSL_METHOD*'
crypto.cpp:2369: error: invalid conversion from 'const SSL_CIPHER*' to 'SSL_CIPHER*'
gmake[3]: *** [crypto.lo] Ошибка 1
gmake[3]: *** Ожидание завершения заданий...
mv -f .deps/kdatetimedlg.Tpo .deps/kdatetimedlg.Plo
mv -f .deps/certexport.Tpo .deps/certexport.Plo
gmake[3]: Выход из каталога `/usr/ports/x11/kdebase3/work/kdebase-3.5.10/kcontrol/crypto'
gmake[2]: *** [all-recursive] Ошибка 1
gmake[2]: Выход из каталога `/usr/ports/x11/kdebase3/work/kdebase-3.5.10/kcontrol'
gmake[1]: *** [all-recursive] Ошибка 1
gmake[1]: Выход из каталога `/usr/ports/x11/kdebase3/work/kdebase-3.5.10'
gmake: *** [all] Ошибка 2
*** Error code 1

Хостинговая компания Host-Food.ru
Хостинг HostFood.ru
 

Услуги хостинговой компании Host-Food.ru

Хостинг HostFood.ru

Тарифы на хостинг в России, от 12 рублей: https://www.host-food.ru/tariffs/hosting/
Тарифы на виртуальные сервера (VPS/VDS/KVM) в РФ, от 189 руб.: https://www.host-food.ru/tariffs/virtualny-server-vps/
Выделенные сервера, Россия, Москва, от 2000 рублей (HP Proliant G5, Intel Xeon E5430 (2.66GHz, Quad-Core, 12Mb), 8Gb RAM, 2x300Gb SAS HDD, P400i, 512Mb, BBU):
https://www.host-food.ru/tariffs/vydelennyi-server-ds/
Недорогие домены в популярных зонах: https://www.host-food.ru/domains/

SKazurov
ефрейтор
Сообщения: 51
Зарегистрирован: 2008-09-06 15:15:15

Re: freebsd 9.0 и KDE3

Непрочитанное сообщение SKazurov » 2012-06-18 8:26:11

Решил похожую проблему (правда на 8ке) удалением Openssl и преустановкой клиента OpenLDAP.

ski
старшина
Сообщения: 412
Зарегистрирован: 2008-08-25 18:10:44
Откуда: СССР, РФ, Сталинградская область, село Безродное
Контактная информация:

Re: freebsd 9.0 и KDE3

Непрочитанное сообщение ski » 2012-06-18 20:32:18

SKazurov писал(а):Решил похожую проблему (правда на 8ке) удалением Openssl и преустановкой клиента OpenLDAP.
Спасибо, попробую.