Обновление chromium-28.0.1500.95 to 29.0.1547.57

Простые/общие вопросы по UNIX системам. Спросите здесь, если вы новичок

Модераторы: vadim64, terminus

Правила форума
Убедительная просьба юзать теги [cоde] при оформлении листингов.
Сообщения не оформленные должным образом имеют все шансы быть незамеченными.
Аватара пользователя
Elimelech
лейтенант
Сообщения: 662
Зарегистрирован: 2009-11-28 18:42:07
Откуда: Украина
Контактная информация:

Обновление chromium-28.0.1500.95 to 29.0.1547.57

Непрочитанное сообщение Elimelech » 2013-08-24 10:07:34

Не могу обновить с портов браузер, зависает на следующей ошибке:

root@f3ja:/usr/ports/www/chromium # make reinstall clean
===> Building for chromium-29.0.1547.57
cd /usr/ports/www/chromium/work/chromium-courgette-redacted-29.0.1547.57 && /usr/bin/env COMPILER_PATH=/usr/local/bin BUILDTYPE=Release GPERF=/usr/local/bin/gperf SHELL=/bin/sh NO_LINT=YES ADDR2LINE="/usr/local/bin/addr2line" AR="/usr/local/bin/ar" AS="/usr/local/bin/as" CPPFILT="/usr/local/bin/c++filt" GPROF="/usr/local/bin/gprof" LD="/usr/local/bin/ld" NM="/usr/local/bin/nm" OBJCOPY="/usr/local/bin/objcopy" OBJDUMP="/usr/local/bin/objdump" RANLIB="/usr/local/bin/ranlib" READELF="/usr/local/bin/readelf" SIZE="/usr/local/bin/size" STRINGS="/usr/local/bin/strings" PREFIX=/usr/local LOCALBASE=/usr/local LIBDIR="/usr/lib" CC="gcc46" CFLAGS="-O2 -pipe -Wl,-rpath=/usr/local/lib/gcc46 -fno-strict-aliasing" CPP="cpp46" CPPFLAGS="" LDFLAGS=" -Wl,-rpath=/usr/local/lib/gcc46" CXX="g++46" CXXFLAGS="-O2 -pipe -Wl,-rpath=/usr/local/lib/gcc46 -fno-strict-aliasing -Wl,-rpath=/usr/local/lib/gcc46" MANPREFIX="/usr/local" BSD_INSTALL_PROGRAM="install -s -o root -g wheel -m 555" BSD_INSTALL_LIB="install -s -o root -g wheel -m 444" BSD_INSTALL_SCRIPT="install -o root -g wheel -m 555" BSD_INSTALL_DATA="install -o root -g wheel -m 444" BSD_INSTALL_MAN="install -o root -g wheel -m 444" /usr/local/bin/ninja -j2 -C out/Release chrome
ninja: Entering directory `out/Release'
[4/10877] CXX obj/base/base.file_util_posix.o
FAILED: /usr/local/bin/clang++ -MMD -MF obj/base/base.file_util_posix.o.d -DANGLE_DX11 -D_FILE_OFFSET_BITS=64 -DNO_TCMALLOC -DDISABLE_NACL -DCHROMIUM_BUILD -DUSE_DEFAULT_RENDER_THEME=1 -DUSE_LIBJPEG_TURBO=1 -DUSE_NSS=1 -DUSE_X11=1 -DENABLE_ONE_CLICK_SIGNIN -DGTK_DISABLE_SINGLE_INCLUDES=1 -DENABLE_REMOTING=1 -DENABLE_WEBRTC=1 -DUSE_PROPRIETARY_CODECS -DENABLE_CONFIGURATION_POLICY -DENABLE_INPUT_SPEECH -DENABLE_NOTIFICATIONS -DENABLE_GPU=1 -DENABLE_EGLIMAGE=1 -DENABLE_TASK_MANAGER=1 -DENABLE_EXTENSIONS=1 -DENABLE_PLUGIN_INSTALLATION=1 -DENABLE_PLUGINS=1 -DENABLE_SESSION_SERVICE=1 -DENABLE_THEMES=1 -DENABLE_BACKGROUND=1 -DENABLE_AUTOMATION=1 -DENABLE_GOOGLE_NOW=1 -DENABLE_LANGUAGE_DETECTION=1 -DENABLE_PRINTING=1 -DENABLE_CAPTIVE_PORTAL_DETECTION=1 -DENABLE_MANAGED_USERS=1 -DUSE_SYMBOLIZE -D__STDC_CONSTANT_MACROS -D__STDC_FORMAT_MACROS -DBASE_IMPLEMENTATION -DNDEBUG -DOFFICIAL_BUILD -DNVALGRIND -DDYNAMIC_ANNOTATIONS_ENABLED=0 -D_FORTIFY_SOURCE=2 -I/usr/local/include -I../.. -fstack-protector --param=ssp-buffer-size=4 -pthread -fno-exceptions -fno-strict-aliasing -Wall -Wno-unused-parameter -Wno-missing-field-initializers -fvisibility=hidden -pipe -fPIC -Wheader-hygiene -Wno-char-subscripts -Wno-unused-function -Wno-covered-switch-default -Wstring-conversion -Wno-c++11-narrowing -Wno-reserved-user-defined-literal -momit-leaf-frame-pointer -fcolor-diagnostics -Wno-write-strings -I/usr/local/include/gtk-2.0 -I/usr/local/include/gio-unix-2.0/ -I/usr/local/include/atk-1.0 -I/usr/local/include/cairo -I/usr/local/include/pixman-1 -D_THREAD_SAFE -I/usr/local/include/gdk-pixbuf-2.0 -I/usr/local/include/libpng15 -I/usr/local/include/pango-1.0 -I/usr/local/include/freetype2 -I/usr/local/include/harfbuzz -pthread -I/usr/local/include/glib-2.0 -I/usr/local/include -pthread -I/usr/local/include/glib-2.0 -I/usr/local/include -D_THREAD_SAFE -I/usr/local/include -Wexit-time-destructors -m32 -mmmx -O2 -fdata-sections -ffunction-sections -fno-unwind-tables -fno-asynchronous-unwind-tables -O2 -pipe -fno-strict-aliasing -fno-rtti -fno-threadsafe-statics -fvisibility-inlines-hidden -Wsign-compare -std=gnu++11 -c ../../base/file_util_posix.cc -o obj/base/base.file_util_posix.o
../../base/file_util_posix.cc:604:63: error: no member named 'st_mtim' in 'stat'
results->last_modified = base::Time::FromTimeSpec(file_info.st_mtim);
~~~~~~~~~ ^
../../base/file_util_posix.cc:605:63: error: no member named 'st_atim' in 'stat'
results->last_accessed = base::Time::FromTimeSpec(file_info.st_atim);
~~~~~~~~~ ^
../../base/file_util_posix.cc:606:63: error: no member named 'st_ctim' in 'stat'
results->creation_time = base::Time::FromTimeSpec(file_info.st_ctim);
~~~~~~~~~ ^
3 errors generated.
[4/10877] CXX obj/base/metrics/base.statistics_recorder.o
ninja: build stopped: subcommand failed.
*** Error code 1

Stop in /usr/ports/www/chromium.
*** Error code 1

Stop in /usr/ports/www/chromium.
*** Error code 1

Stop in /usr/ports/www/chromium.



что делать?
Спасибо за ответ!

Хостинговая компания Host-Food.ru
Хостинг HostFood.ru
 

Услуги хостинговой компании Host-Food.ru

Хостинг HostFood.ru

Тарифы на хостинг в России, от 12 рублей: https://www.host-food.ru/tariffs/hosting/
Тарифы на виртуальные сервера (VPS/VDS/KVM) в РФ, от 189 руб.: https://www.host-food.ru/tariffs/virtualny-server-vps/
Выделенные сервера, Россия, Москва, от 2000 рублей (HP Proliant G5, Intel Xeon E5430 (2.66GHz, Quad-Core, 12Mb), 8Gb RAM, 2x300Gb SAS HDD, P400i, 512Mb, BBU):
https://www.host-food.ru/tariffs/vydelennyi-server-ds/
Недорогие домены в популярных зонах: https://www.host-food.ru/domains/

Аватара пользователя
hizel
дядя поня
Сообщения: 9031
Зарегистрирован: 2007-06-29 10:05:02
Откуда: Выборг

Re: Обновление chromium-28.0.1500.95 to 29.0.1547.57

Непрочитанное сообщение hizel » 2013-08-25 18:48:19

Открыть для себя тэг code и portmaster
В дурацкие игры он не играет. Он просто жуткий, чу-чу, паровозик, и зовут его Блейн. Блейн --- это Боль.

Аватара пользователя
Elimelech
лейтенант
Сообщения: 662
Зарегистрирован: 2009-11-28 18:42:07
Откуда: Украина
Контактная информация:

Re: Обновление chromium-28.0.1500.95 to 29.0.1547.57

Непрочитанное сообщение Elimelech » 2013-08-25 19:48:05

если portmaster я понял что это, а что такое тэг code? Объясните для тех кто в танке. Спасибо!

Аватара пользователя
hizel
дядя поня
Сообщения: 9031
Зарегистрирован: 2007-06-29 10:05:02
Откуда: Выборг

Re: Обновление chromium-28.0.1500.95 to 29.0.1547.57

Непрочитанное сообщение hizel » 2013-08-25 19:55:13

О, не, я с танкистами не общаюсь, прастити(
В дурацкие игры он не играет. Он просто жуткий, чу-чу, паровозик, и зовут его Блейн. Блейн --- это Боль.

Аватара пользователя
Elimelech
лейтенант
Сообщения: 662
Зарегистрирован: 2009-11-28 18:42:07
Откуда: Украина
Контактная информация:

Re: Обновление chromium-28.0.1500.95 to 29.0.1547.57

Непрочитанное сообщение Elimelech » 2013-08-25 20:11:11

ну нет так нет. А если я летчик в душе

Аватара пользователя
vg
мл. сержант
Сообщения: 94
Зарегистрирован: 2008-06-29 15:53:43
Откуда: Омск

Re: Обновление chromium-28.0.1500.95 to 29.0.1547.57

Непрочитанное сообщение vg » 2013-08-27 8:15:30

Elimelech писал(а):если portmaster я понял что это, а что такое тэг code? Объясните для тех кто в танке. Спасибо!
Лётчик в танке?

Изображение
BSDец приходит незаметно

ski
старшина
Сообщения: 408
Зарегистрирован: 2008-08-25 18:10:44
Откуда: СССР, РФ, Сталинградская область, село Безродное
Контактная информация:

Re: Обновление chromium-28.0.1500.95 to 29.0.1547.57

Непрочитанное сообщение ski » 2013-08-27 12:36:30

Elimelech писал(а):если portmaster я понял что это, а что такое тэг code? Объясните для тех кто в танке. Спасибо!
Вставил в пост вывод, лог, листинг и тыпы - выдели его и нажми кнопочку

Код: Выделить всё

 сверху поля ввода. Народ требует от тебя аккуратности оформления постов. Тут так принято.

Аватара пользователя
Elimelech
лейтенант
Сообщения: 662
Зарегистрирован: 2009-11-28 18:42:07
Откуда: Украина
Контактная информация:

Re: Обновление chromium-28.0.1500.95 to 29.0.1547.57

Непрочитанное сообщение Elimelech » 2013-08-27 12:47:19

какие вы все умные. И каким образом я сейчас могу поменять код на странице форума?

rayder
лейтенант
Сообщения: 661
Зарегистрирован: 2008-12-18 16:29:43
Откуда: Ukraine/Kiev
Контактная информация:

Re: Обновление chromium-28.0.1500.95 to 29.0.1547.57

Непрочитанное сообщение rayder » 2013-08-28 20:11:39

ну например после того как вас попросили просто продублировать свое сообщение, но при этом правильно его оформить!
ЗЫ. были бы мы все глупые, вы бы сюда за помощью не пришли. не так ли? Сами подумайте как можно прочитать то, что вы вставили в сообщение, оно же глаза режет...
Человеку свойственно ошибаться, но для нечеловеческих ляпов нужен компьютер.

Гость
проходил мимо

Re: Обновление chromium-28.0.1500.95 to 29.0.1547.57

Непрочитанное сообщение Гость » 2013-08-28 20:20:38

rayder писал(а):ну например после того как вас попросили просто продублировать свое сообщение, но при этом правильно его оформить!
ЗЫ. были бы мы все глупые, вы бы сюда за помощью не пришли. не так ли? Сами подумайте как можно прочитать то, что вы вставили в сообщение, оно же глаза режет...
Спасибо. Но когда мне писали, уже не было возможности ни удалить ни исправить. А по делу так никто и не ответил.

ski
старшина
Сообщения: 408
Зарегистрирован: 2008-08-25 18:10:44
Откуда: СССР, РФ, Сталинградская область, село Безродное
Контактная информация:

Re: Обновление chromium-28.0.1500.95 to 29.0.1547.57

Непрочитанное сообщение ski » 2013-08-29 7:48:17

Гость писал(а): Спасибо. Но когда мне писали, уже не было возможности ни удалить ни исправить. А по делу так никто и не ответил.
А по делу тебе уже ответили: portsnap и portmaster.
Ибо оно явно через какую-то зависимость падает.

Гость
проходил мимо

Re: Обновление chromium-28.0.1500.95 to 29.0.1547.57

Непрочитанное сообщение Гость » 2013-08-29 22:20:20

ski писал(а):
Гость писал(а): Спасибо. Но когда мне писали, уже не было возможности ни удалить ни исправить. А по делу так никто и не ответил.
А по делу тебе уже ответили: portsnap и portmaster.
Ибо оно явно через какую-то зависимость падает.
Ох, как мне это круто помогло, что вы мне сказали что что-то там падает. Спасибо!

rayder
лейтенант
Сообщения: 661
Зарегистрирован: 2008-12-18 16:29:43
Откуда: Ukraine/Kiev
Контактная информация:

Re: Обновление chromium-28.0.1500.95 to 29.0.1547.57

Непрочитанное сообщение rayder » 2013-08-30 0:03:24

чукча писатель а не читатель (с) анекдот
по сути, вы вместо того чтобы уточнить что именно вам посоветовали, а еще лучше почитать, начинаете возмущаться.

У меня пока-что к вам только один вопрос: если вам лень учиться и разбираться, то зачем вы полезли в столь непростую систему как FReeBSD?
по сути проблемы даже отвечать ничего не буду, пока вы не почитаете хотя бы то о чем вам сказали (portsnap и portmaster). А что там не собирается даже и не читал до сих пор.
Человеку свойственно ошибаться, но для нечеловеческих ляпов нужен компьютер.

Гость
проходил мимо

Re: Обновление chromium-28.0.1500.95 to 29.0.1547.57

Непрочитанное сообщение Гость » 2013-08-30 14:42:50

rayder писал(а):чукча писатель а не читатель (с) анекдот
по сути, вы вместо того чтобы уточнить что именно вам посоветовали, а еще лучше почитать, начинаете возмущаться.

У меня пока-что к вам только один вопрос: если вам лень учиться и разбираться, то зачем вы полезли в столь непростую систему как FReeBSD?
по сути проблемы даже отвечать ничего не буду, пока вы не почитаете хотя бы то о чем вам сказали (portsnap и portmaster). А что там не собирается даже и не читал до сих пор.
спасибо за умные слова.

Гость
проходил мимо

Re: Обновление chromium-28.0.1500.95 to 29.0.1547.57

Непрочитанное сообщение Гость » 2013-08-31 13:51:47

Вот какой день борюсь с установкой новой версии браузера, но каждый раз появляются новые ошибки:

Код: Выделить всё

===>  Configuring for chromium-29.0.1547.57
cd /usr/ports/www/chromium/work/chromium-courgette-redacted-29.0.1547.57 && /usr/bin/env COMPILER_PATH=/usr/local/bin CC=gcc46  CXX=g++46  CFLAGS="-O2 -pipe -Wl,-rpath=/usr/local/lib/gcc46 -fno-strict-aliasing"  CXXFLAGS="-O2 -pipe -Wl,-rpath=/usr/local/lib/gcc46 -fno-strict-aliasing -Wl,-rpath=/usr/local/lib/gcc46"  CPPFLAGS=""  LDFLAGS=" -Wl,-rpath=/usr/local/lib/gcc46"  GYP_GENERATORS=ninja  GYP_DEFINES="use_cups=1  use_system_yasm=1  use_system_libxml=1  use_system_ffmpeg=0  use_system_libusb=1  use_system_libevent=1  use_system_libvpx=0  linux_breakpad=0  linux_strip_binary=1  linux_use_tcmalloc=0  linux_use_heapchecker=0  test_isolation_mode=noop  clang_use_chrome_plugins=0  disable_nacl=1  enable_webrtc=1  enable_openmax=1  enable_one_click_signin=1  werror=  no_gc_sections=1  os_ver=804000  prefix_dir=/usr/local  python_ver=2.7 google_api_key=AIzaSyBsp9n41JLW8jCokwn7vhoaMejDFRd1mp8  google_default_client_id=996322985003.apps.googleusercontent.com  google_default_client_secret=IR1za9-1VK0zZ0f_O8MVFicn ffmpeg_branding=Chrome proprietary_codecs=1 use_pulseaudio=1 disable_sse2=1 gcc_version=46 buildtype=Official" PYTHON="/usr/local/bin/python2.7" PKG_CONFIG=pkgconf SHELL=/bin/sh CONFIG_SHELL=/bin/sh /usr/local/bin/python2.7  ./build/gyp_chromium chrome/chrome.gyp --depth .
Updating projects from gyp files...
parse exception: run GRIT with the -x flag to debug .grd problems
Traceback (most recent call last):
  File "./build/gyp_chromium", line 156, in <module>
    sys.exit(gyp.main(args))
  File "/usr/ports/www/chromium/work/chromium-courgette-redacted-29.0.1547.57/tools/gyp/pylib/gyp/__init__.py", line 540, in main
    return gyp_main(args)
  File "/usr/ports/www/chromium/work/chromium-courgette-redacted-29.0.1547.57/tools/gyp/pylib/gyp/__init__.py", line 516, in gyp_main
    options.circular_check)
  File "/usr/ports/www/chromium/work/chromium-courgette-redacted-29.0.1547.57/tools/gyp/pylib/gyp/__init__.py", line 131, in Load
    params['parallel'])
  File "/usr/ports/www/chromium/work/chromium-courgette-redacted-29.0.1547.57/tools/gyp/pylib/gyp/input.py", line 2573, in Load
    variables, includes, depth, check, True)
  File "/usr/ports/www/chromium/work/chromium-courgette-redacted-29.0.1547.57/tools/gyp/pylib/gyp/input.py", line 439, in LoadTargetBuildFile
    includes, depth, check, load_dependencies)
  File "/usr/ports/www/chromium/work/chromium-courgette-redacted-29.0.1547.57/tools/gyp/pylib/gyp/input.py", line 389, in LoadTargetBuildFile
    build_file_data, PHASE_EARLY, variables, build_file_path)
  File "/usr/ports/www/chromium/work/chromium-courgette-redacted-29.0.1547.57/tools/gyp/pylib/gyp/input.py", line 1220, in ProcessVariablesAndConditionsInDict
    build_file)
  File "/usr/ports/www/chromium/work/chromium-courgette-redacted-29.0.1547.57/tools/gyp/pylib/gyp/input.py", line 1235, in ProcessVariablesAndConditionsInList
    ProcessVariablesAndConditionsInDict(item, phase, variables, build_file)
  File "/usr/ports/www/chromium/work/chromium-courgette-redacted-29.0.1547.57/tools/gyp/pylib/gyp/input.py", line 1220, in ProcessVariablesAndConditionsInDict
    build_file)
  File "/usr/ports/www/chromium/work/chromium-courgette-redacted-29.0.1547.57/tools/gyp/pylib/gyp/input.py", line 1235, in ProcessVariablesAndConditionsInList
    ProcessVariablesAndConditionsInDict(item, phase, variables, build_file)
  File "/usr/ports/www/chromium/work/chromium-courgette-redacted-29.0.1547.57/tools/gyp/pylib/gyp/input.py", line 1220, in ProcessVariablesAndConditionsInDict
    build_file)
  File "/usr/ports/www/chromium/work/chromium-courgette-redacted-29.0.1547.57/tools/gyp/pylib/gyp/input.py", line 1239, in ProcessVariablesAndConditionsInList
    expanded = ExpandVariables(item, phase, variables, build_file)
  File "/usr/ports/www/chromium/work/chromium-courgette-redacted-29.0.1547.57/tools/gyp/pylib/gyp/input.py", line 859, in ExpandVariables
    replacement = str(py_module.DoMain(parsed_contents[1:])).rstrip()
  File "/usr/ports/www/chromium/work/chromium-courgette-redacted-29.0.1547.57/tools/grit/grit_info.py", line 138, in DoMain
    options.target_platform)
  File "/usr/ports/www/chromium/work/chromium-courgette-redacted-29.0.1547.57/tools/grit/grit_info.py", line 68, in Inputs
    first_ids_file=ids_file, target_platform=target_platform)
  File "/usr/ports/www/chromium/work/chromium-courgette-redacted-29.0.1547.57/tools/grit/grit/grd_reader.py", line 180, in Parse
    xml.sax.parse(filename_or_stream, handler)
  File "/usr/local/lib/python2.7/xml/sax/__init__.py", line 33, in parse
    parser.parse(source)
  File "/usr/local/lib/python2.7/xml/sax/expatreader.py", line 107, in parse
    xmlreader.IncrementalParser.parse(self, source)
  File "/usr/local/lib/python2.7/xml/sax/xmlreader.py", line 123, in parse
    self.feed(buffer)
  File "/usr/local/lib/python2.7/xml/sax/expatreader.py", line 210, in feed
    self._parser.Parse(data, isFinal)
  File "/usr/local/lib/python2.7/xml/sax/expatreader.py", line 307, in end_element
    self._cont_handler.endElement(name)
  File "/usr/ports/www/chromium/work/chromium-courgette-redacted-29.0.1547.57/tools/grit/grit/grd_reader.py", line 93, in endElement
    self.stack.pop().EndParsing()
  File "/usr/ports/www/chromium/work/chromium-courgette-redacted-29.0.1547.57/tools/grit/grit/node/misc.py", line 209, in EndParsing
    self.ValidateUniqueIds()
  File "/usr/ports/www/chromium/work/chromium-courgette-redacted-29.0.1547.57/tools/grit/grit/node/misc.py", line 229, in ValidateUniqueIds
    for node in self.ActiveDescendants():
  File "/usr/ports/www/chromium/work/chromium-courgette-redacted-29.0.1547.57/tools/grit/grit/node/base.py", line 79, in ActiveDescendants
    for descendant in child.ActiveDescendants():
  File "/usr/ports/www/chromium/work/chromium-courgette-redacted-29.0.1547.57/tools/grit/grit/node/base.py", line 79, in ActiveDescendants
    for descendant in child.ActiveDescendants():
  File "/usr/ports/www/chromium/work/chromium-courgette-redacted-29.0.1547.57/tools/grit/grit/node/base.py", line 79, in ActiveDescendants
    for descendant in child.ActiveDescendants():
  File "/usr/ports/www/chromium/work/chromium-courgette-redacted-29.0.1547.57/tools/grit/grit/node/base.py", line 78, in ActiveDescendants
    for child in self.ActiveChildren():
  File "/usr/ports/www/chromium/work/chromium-courgette-redacted-29.0.1547.57/tools/grit/grit/node/misc.py", line 105, in ActiveChildren
    cond = self.EvaluateCondition(self.attrs['expr'])
  File "/usr/ports/www/chromium/work/chromium-courgette-redacted-29.0.1547.57/tools/grit/grit/node/base.py", line 500, in EvaluateCondition
    expr, defs, target_platform, extra_variables)
  File "/usr/ports/www/chromium/work/chromium-courgette-redacted-29.0.1547.57/tools/grit/grit/node/base.py", line 471, in EvaluateExpression
    eval_result = cache_dict[expr] = eval(expr, {}, variable_map)
  File "<string>", line 1, in <module>
NameError: name 'is_bsd' is not defined while loading dependencies of chrome/chrome.gyp while trying to load chrome/chrome.gyp
*** Error code 1

Stop in /usr/ports/www/chromium.
*** Error code 1

Stop in /usr/ports/www/chromium.
*** Error code 1

Stop in /usr/ports/www/chromium.

Аватара пользователя
hizel
дядя поня
Сообщения: 9031
Зарегистрирован: 2007-06-29 10:05:02
Откуда: Выборг

Re: Обновление chromium-28.0.1500.95 to 29.0.1547.57

Непрочитанное сообщение hizel » 2013-08-31 16:03:32

Кстати, мантейнеру chromium надо живительных звиздюлей прописать, обновляет порт и не увеличивает PORTREVISION

По первому сообщению внезапно: http://www.freshports.org/commit.php?ca ... reebsd.org
В дурацкие игры он не играет. Он просто жуткий, чу-чу, паровозик, и зовут его Блейн. Блейн --- это Боль.

Гость
проходил мимо

Re: Обновление chromium-28.0.1500.95 to 29.0.1547.57

Непрочитанное сообщение Гость » 2013-08-31 23:06:04

hizel писал(а):Кстати, мантейнеру chromium надо живительных звиздюлей прописать, обновляет порт и не увеличивает PORTREVISION

По первому сообщению внезапно: http://www.freshports.org/commit.php?ca ... reebsd.org
последняя попытка окончилась тоже неудачно:

Код: Выделить всё

===>  Building for chromium-29.0.1547.57
cd /usr/ports/www/chromium/work/chromium-courgette-redacted-29.0.1547.57 && /usr/bin/env COMPILER_PATH=/usr/local/bin BUILDTYPE=Release  GPERF=/usr/local/bin/gperf SHELL=/bin/sh NO_LINT=YES ADDR2LINE="/usr/local/bin/addr2line" AR="/usr/local/bin/ar" AS="/usr/local/bin/as" CPPFILT="/usr/local/bin/c++filt" GPROF="/usr/local/bin/gprof" LD="/usr/local/bin/ld" NM="/usr/local/bin/nm" OBJCOPY="/usr/local/bin/objcopy" OBJDUMP="/usr/local/bin/objdump" RANLIB="/usr/local/bin/ranlib" READELF="/usr/local/bin/readelf" SIZE="/usr/local/bin/size" STRINGS="/usr/local/bin/strings" PREFIX=/usr/local  LOCALBASE=/usr/local  LIBDIR="/usr/lib"  CC="gcc46" CFLAGS="-O2 -pipe -Wl,-rpath=/usr/local/lib/gcc46 -fno-strict-aliasing"  CPP="cpp46" CPPFLAGS=""  LDFLAGS=" -Wl,-rpath=/usr/local/lib/gcc46"  CXX="g++46" CXXFLAGS="-O2 -pipe -Wl,-rpath=/usr/local/lib/gcc46 -fno-strict-aliasing -Wl,-rpath=/usr/local/lib/gcc46"  MANPREFIX="/usr/local" BSD_INSTALL_PROGRAM="install  -s -o root -g wheel -m 555"  BSD_INSTALL_LIB="install  -s -o root -g wheel -m 444"  BSD_INSTALL_SCRIPT="install  -o root -g wheel -m 555"  BSD_INSTALL_DATA="install  -o root -g wheel -m 444"  BSD_INSTALL_MAN="install  -o root -g wheel -m 444" /usr/local/bin/ninja  -j2 -C out/Release chrome
ninja: Entering directory `out/Release'
[170/11990] LINK libvpx_obj_int_extract
FAILED: g++46 -Wl,-rpath=/usr/local/lib/gcc46 -Wl,-z,now -Wl,-z,relro -pthread -Wl,-z,noexecstack -fPIC -Wl,--no-keep-memory -m32 -Wl,-O1 -Wl,--as-needed -o libvpx_obj_int_extract -Wl,--start-group obj/third_party/libvpx/source/libvpx/build/make/libvpx_obj_int_extract.obj_int_extract.o  -Wl,--end-group 
obj/third_party/libvpx/source/libvpx/build/make/libvpx_obj_int_extract.obj_int_extract.o: In function `parse_elf':
obj_int_extract.c:(.text.parse_elf+0x71a): undefined reference to `__stack_chk_fail_local'
/usr/local/bin/ld: libvpx_obj_int_extract: скрытый символ «__stack_chk_fail_local» не определён
/usr/local/bin/ld: final link failed: Некорректное значение
collect2: ld returned 1 exit status
[170/11990] ACTION concatenated_devtools_audits_js: concatenate_devtools_audits_js_4d3228d64cbf1529cdfe4cd96203802c
ninja: build stopped: subcommand failed.
*** Error code 1

Stop in /usr/ports/www/chromium.
*** Error code 1

Stop in /usr/ports/www/chromium.
*** Error code 1

Stop in /usr/ports/www/chromium.

Аватара пользователя
Alvares
прапорщик
Сообщения: 482
Зарегистрирован: 2008-07-10 12:48:08
Откуда: Воронеж
Контактная информация:

Re: Обновление chromium-28.0.1500.95 to 29.0.1547.57

Непрочитанное сообщение Alvares » 2013-09-02 7:44:45

а если не GCC46 а штатным собирать, то же самое?
Бог создал людей сильными и слабыми. Сэмюэл Кольт сделал их равными...

ski
старшина
Сообщения: 408
Зарегистрирован: 2008-08-25 18:10:44
Откуда: СССР, РФ, Сталинградская область, село Безродное
Контактная информация:

Re: Обновление chromium-28.0.1500.95 to 29.0.1547.57

Непрочитанное сообщение ski » 2013-09-02 8:26:06